Jump to content

Recommended Posts

Every single time I try to extract to project I now get this error message (modded game is Skyrim original): 

Spoiler

Traceback (most recent call last):
  File "bash\balt.pyo", line 2435, in __Execute
  File "bash\balt.pyo", line 1563, in _conversation_wrapper
  File "bash\basher\installer_links.pyo", line 987, in Execute
  File "bash\bosh\__init__.pyo", line 5151, in unpackToProject
  File "bash\bosh\__init__.pyo", line 5079, in unpackToTemp
  File "bash\bosh\__init__.pyo", line 4089, in rmTempDir
  File "bash\bolt.pyo", line 897, in rmtree
  File "shutil.pyo", line 247, in rmtree
  File "shutil.pyo", line 247, in rmtree
  File "shutil.pyo", line 256, in rmtree
  File "shutil.pyo", line 254, in rmtree
WindowsError: [Error 5] Access is denied: u'c:\\users\\luis\\appdata\\local\\temp\\WryeBash_xp8rq_\\Ancient Dwemer Metal 2K\\meshes'
 

It had been working fine until now. I tried to restart wrye bash, restart windows, did a full refresh of my installers (which took over 20 minutes, I have 280 installers at the moment) but the error persists. Could something have got corrupted in the program??

I'm using Wrye Bash 3.07 beta1 standalone.

 

EDIT: I'm getting a similar error when installing, so wrye bash is completely broken at the moment...

Spoiler

Traceback (most recent call last):
  File "bash\balt.pyo", line 2435, in __Execute
  File "bash\balt.pyo", line 1563, in _conversation_wrapper
  File "bash\basher\installer_links.pyo", line 543, in Execute
  File "bash\bosh\__init__.pyo", line 6200, in bain_install
  File "bash\bosh\__init__.pyo", line 6175, in _install
  File "bash\bosh\__init__.pyo", line 5349, in install
  File "bash\bosh\__init__.pyo", line 4089, in rmTempDir
  File "bash\bolt.pyo", line 897, in rmtree
  File "shutil.pyo", line 247, in rmtree
  File "shutil.pyo", line 247, in rmtree
  File "shutil.pyo", line 256, in rmtree
  File "shutil.pyo", line 254, in rmtree
WindowsError: [Error 5] Access is denied: u'c:\\users\\luis\\appdata\\local\\temp\\WryeBash_xp8rq_\\Ancient Dwemer Metal 2K\\meshes'

 

Link to post
Share on other sites
6 hours ago, godescalcus said:

Every single time I try to extract to project I now get this error message (modded game is Skyrim original): 

  Reveal hidden contents

Traceback (most recent call last):
  File "bash\balt.pyo", line 2435, in __Execute
  File "bash\balt.pyo", line 1563, in _conversation_wrapper
  File "bash\basher\installer_links.pyo", line 987, in Execute
  File "bash\bosh\__init__.pyo", line 5151, in unpackToProject
  File "bash\bosh\__init__.pyo", line 5079, in unpackToTemp
  File "bash\bosh\__init__.pyo", line 4089, in rmTempDir
  File "bash\bolt.pyo", line 897, in rmtree
  File "shutil.pyo", line 247, in rmtree
  File "shutil.pyo", line 247, in rmtree
  File "shutil.pyo", line 256, in rmtree
  File "shutil.pyo", line 254, in rmtree
WindowsError: [Error 5] Access is denied: u'c:\\users\\luis\\appdata\\local\\temp\\WryeBash_xp8rq_\\Ancient Dwemer Metal 2K\\meshes'
 

It had been working fine until now. I tried to restart wrye bash, restart windows, did a full refresh of my installers (which took over 20 minutes, I have 280 installers at the moment) but the error persists. Could something have got corrupted in the program??

I'm using Wrye Bash 3.07 beta1 standalone.

 

EDIT: I'm getting a similar error when installing, so wrye bash is completely broken at the moment...

  Reveal hidden contents

Traceback (most recent call last):
  File "bash\balt.pyo", line 2435, in __Execute
  File "bash\balt.pyo", line 1563, in _conversation_wrapper
  File "bash\basher\installer_links.pyo", line 543, in Execute
  File "bash\bosh\__init__.pyo", line 6200, in bain_install
  File "bash\bosh\__init__.pyo", line 6175, in _install
  File "bash\bosh\__init__.pyo", line 5349, in install
  File "bash\bosh\__init__.pyo", line 4089, in rmTempDir
  File "bash\bolt.pyo", line 897, in rmtree
  File "shutil.pyo", line 247, in rmtree
  File "shutil.pyo", line 247, in rmtree
  File "shutil.pyo", line 256, in rmtree
  File "shutil.pyo", line 254, in rmtree
WindowsError: [Error 5] Access is denied: u'c:\\users\\luis\\appdata\\local\\temp\\WryeBash_xp8rq_\\Ancient Dwemer Metal 2K\\meshes'

 

Is there any problem with the file in the traceback?

c:\\users\\luis\\appdata\\local\\temp\\WryeBash_xp8rq_\\Ancient Dwemer Metal 2K\\meshes'

If not, the best bet to having this looked at promptly is at the new official thread.

Link to post
Share on other sites
57 minutes ago, Leonardo said:

Have you tried to install the latest WB307 beta?

 

Also, make sure you are using the recommended Python version.  In other words, just follow the instructions here.

I use the 3.07 beta standalone from nexus (http://www.nexusmods.com/skyrim/mods/1840/?)

I've also posted this problem there. I've been able to overcome this by running WB with elevated permissions, but that breaks the drag-drop to installers tab ability. Seems like something made the appdata/local/temp folder require elevated permissions? Has anyone experienced this yet?

Link to post
Share on other sites

Create an account or sign in to comment

You need to be a member in order to leave a comment

Create an account

Sign up for a new account in our community. It's easy!

Register a new account

Sign in

Already have an account? Sign in here.

Sign In Now
×
×
  • Create New...